Reaction Details
TargetBcl-2-like protein 1
LigandBDBM50428723
Substrate/Competitorn/a
Meas. Tech.ChEMBL_947461 (CHEMBL2345537)
Ki 4690±n/a nM
Citation Zhang, ZSong, TLi, XWu, ZFeng, YXie, FLiu, CQin, JChen, H Novel soluble myeloid cell leukemia sequence 1 (Mcl-1) inhibitor (E,E)-2-(benzylaminocarbonyl)-3-styrylacrylonitrile (4g) developed using a fragment-based approach. Eur J Med Chem59:141-9 (2013) 
 
Bcl-2-like protein 1
Name:Bcl-2-like protein 1
Type:Mitochondrion membrane; Single-pass membrane protein
Mol. Mass.:26039.60
Organism:Homo sapiens (Human)
Description:n/a
Residue:233
BDBM50428723
NameBDBM50428723
Synonyms:CHEMBL2333153
TypeSmall organic molecule
Emp. Form.C20H19N3O
Mol. Mass.317.3844
SMILESCOC1=CC(=N\C1=C\c1[nH]cc(C)c1C)c1cc2ccccc2[nH]1