Reaction Details
TargetInduced myeloid leukemia cell differentiation protein Mcl-1
LigandBDBM50214870
Substrate/Competitorn/a
Meas. Tech.ChEMBL_947458 (CHEMBL2345534)
Ki 1690±n/a nM
Citation Zhang, ZSong, TLi, XWu, ZFeng, YXie, FLiu, CQin, JChen, H Novel soluble myeloid cell leukemia sequence 1 (Mcl-1) inhibitor (E,E)-2-(benzylaminocarbonyl)-3-styrylacrylonitrile (4g) developed using a fragment-based approach. Eur J Med Chem59:141-9 (2013) 
 
Induced myeloid leukemia cell differentiation protein Mcl-1
Name:Induced myeloid leukemia cell differentiation protein Mcl-1
Type:Membrane; Single-pass membrane protein
Mol. Mass.:37332.87
Organism:Homo sapiens (Human)
Description:Q07820
Residue:350
BDBM50214870
NameBDBM50214870
Synonyms:5,6,7-trihydroxy-8-isobutyl-2-methyl-4H-chromen-4-one | CHEMBL226678
TypeSmall organic molecule
Emp. Form.C14H16O5
Mol. Mass.264.2738
SMILESCC(C)Cc1c(O)c(O)c(O)c2c1oc(C)cc2=O