Reaction Details
TargetInduced myeloid leukemia cell differentiation protein Mcl-1
LigandBDBM50371611
Substrate/Competitorn/a
Meas. Tech.ChEMBL_947458 (CHEMBL2345534)
Ki 37±n/a nM
Citation Zhang, ZSong, TLi, XWu, ZFeng, YXie, FLiu, CQin, JChen, H Novel soluble myeloid cell leukemia sequence 1 (Mcl-1) inhibitor (E,E)-2-(benzylaminocarbonyl)-3-styrylacrylonitrile (4g) developed using a fragment-based approach. Eur J Med Chem59:141-9 (2013) 
 
Induced myeloid leukemia cell differentiation protein Mcl-1
Name:Induced myeloid leukemia cell differentiation protein Mcl-1
Type:Membrane; Single-pass membrane protein
Mol. Mass.:37332.87
Organism:Homo sapiens (Human)
Description:Q07820
Residue:350
BDBM50371611
NameBDBM50371611
Synonyms:CHEMBL258819
TypeSmall organic molecule
Emp. Form.C27H17NO6S
Mol. Mass.483.492
SMILESOc1c(O)c(cc(C(=O)c2ccc(Oc3ccccc3)cc2)c1O)C(=O)c1nc2ccccc2s1