Reaction Details
TargetCyclin-dependent kinase 4/G1/S-specific cyclin-D1
LigandBDBM50241984
Substrate/Competitorn/a
Meas. Tech.ChEMBL_947942 (CHEMBL2344163)
IC50 3600±n/a nM
Citation Niemann, HLin, WMüller, WEKubbutat, MLai, DProksch, P Trimeric hemibastadin congener from the marine sponge Ianthella basta. J Nat Prod76:121-5 (2013) 
 
Cyclin-dependent kinase 4/G1/S-specific cyclin-D1
Name:Cyclin-dependent kinase 4/G1/S-specific cyclin-D1
Type:Protein Complex
Mol. Mass.:n/a
Description:CDK4/D1 complexes were purified from insect cells co-infected with baculovirus vectors containing each of the components.
Components:This complex has 2 components.
Component 1
Name:Cyclin-dependent kinase 4
Synonyms:CDK4 Cell division protein kinase 4 PSK-J3
Type:Enzyme Subunit
Mol. Mass.:33731.96
Organism:Homo sapiens (Human)
Description:P11802
Residue:303
Component 2
Name:G1/S-specific cyclin-D1
Synonyms:B-cell lymphoma 1 protein BCL-1 oncogene CCND1 PRAD1 | PRAD1 oncogene
Type:Enzyme Subunit
Mol. Mass.:33717.70
Organism:Homo sapiens (Human)
Description:n/a
Residue:295
BDBM50241984
NameBDBM50241984
Synonyms:BASTADIN 6 bastadin-6
TypeSmall organic molecule
Emp. Form.C34H26Br6N4O8
Mol. Mass.1098.016
SMILESOc1c(Br)cc2CCNC(=O)C(Cc3cc(Br)c(Oc4cc(CC(N=O)C(=O)NCCc5cc(Br)c(Oc1c2)c(Br)c5)cc(Br)c4O)c(Br)c3)N=O