Reaction Details
TargetAurora kinase B
LigandBDBM50241984
Substrate/Competitorn/a
Meas. Tech.ChEMBL_947946 (CHEMBL2344167)
IC50 2900±n/a nM
Citation Niemann, HLin, WMüller, WEKubbutat, MLai, DProksch, P Trimeric hemibastadin congener from the marine sponge Ianthella basta. J Nat Prod76:121-5 (2013) 
 
Aurora kinase B
Name:Aurora kinase B
Type:Protein
Mol. Mass.:39327.72
Organism:Homo sapiens (Human)
Description:Q96GD4
Residue:344
BDBM50241984
NameBDBM50241984
Synonyms:BASTADIN 6 bastadin-6
TypeSmall organic molecule
Emp. Form.C34H26Br6N4O8
Mol. Mass.1098.016
SMILESOc1c(Br)cc2CCNC(=O)C(Cc3cc(Br)c(Oc4cc(CC(N=O)C(=O)NCCc5cc(Br)c(Oc1c2)c(Br)c5)cc(Br)c4O)c(Br)c3)N=O