Reaction Details
TargetMitogen-activated protein kinase kinase kinase 8
LigandBDBM50428737
Substrate/Competitorn/a
Meas. Tech.ChEMBL_947941 (CHEMBL2344162)
IC50 1600±n/a nM
Citation Niemann, HLin, WMüller, WEKubbutat, MLai, DProksch, P Trimeric hemibastadin congener from the marine sponge Ianthella basta. J Nat Prod76:121-5 (2013) 
 
Mitogen-activated protein kinase kinase kinase 8
Name:Mitogen-activated protein kinase kinase kinase 8
Type:Serine/threonine-protein kinase
Mol. Mass.:52916.89
Organism:Homo sapiens (Human)
Description:P41279
Residue:467
BDBM50428737
NameBDBM50428737
Synonyms:BASTADIN 3
TypeSmall organic molecule
Emp. Form.C34H30Br4N4O8
Mol. Mass.942.24
SMILESOc1ccc(CCNC(=O)C(Cc2cc(Br)c(O)c(c2)-c2cc(CC(N=O)C(=O)NCCc3ccc(O)c(Br)c3)cc(Br)c2O)N=O)cc1Br