Reaction Details
TargetAngiopoietin-1 receptor
LigandBDBM50428738
Substrate/Competitorn/a
Meas. Tech.ChEMBL_947478 (CHEMBL2345554)
IC50 600±n/a nM
Citation Niemann, HLin, WMüller, WEKubbutat, MLai, DProksch, P Trimeric hemibastadin congener from the marine sponge Ianthella basta. J Nat Prod76:121-5 (2013) 
 
Angiopoietin-1 receptor
Name:Angiopoietin-1 receptor
Type:Enzyme
Mol. Mass.:125835.70
Organism:Homo sapiens (Human)
Description:Q02763
Residue:1124
BDBM50428738
NameBDBM50428738
Synonyms:CHEMBL2333163 | Sesquibastadin 1
TypeSmall organic molecule
Emp. Form.C51H44Br6N6O12
Mol. Mass.1412.352
SMILESOc1ccc(CCNC(=O)C(Cc2cc(Br)c(O)c(Oc3ccc(CCNC(=O)C(Cc4cc(Br)c(O)c(c4)-c4cc(CC(N=O)C(=O)NCCc5ccc(O)c(Br)c5)cc(Br)c4O)N=O)cc3Br)c2)N=O)cc1Br