Reaction Details
TargetSubstance-P receptor
LigandBDBM50428768
Substrate/Competitorn/a
Meas. Tech.ChEMBL_948440 (CHEMBL2342730)
IC50 13±n/a nM
Citation Gillman, KWParker, MFSilva, MDegnan, APTora, GOLodge, NJLi, YWLelas, STaber, MKrause, RGBertekap, RLNewton, AEPieschl, RLLengyel, KDJohnson, KATaylor, SJBronson, JJMacor, JE Design, optimization, and in vivo evaluation of a series of pyridine derivatives with dual NK1 antagonism and SERT inhibition for the treatment of depression. Bioorg Med Chem Lett23:407-11 (2012) 
 
Substance-P receptor
Name:Substance-P receptor
Type:G Protein-Coupled Receptor (GPCR)
Mol. Mass.:46254.43
Organism:Homo sapiens (Human)
Description:P25103
Residue:407
BDBM50428768
NameBDBM50428768
Synonyms:CHEMBL2333629
TypeSmall organic molecule
Emp. Form.C26H30F4N4O
Mol. Mass.490.5362
SMILESCN1CCC(COCc2cc(cc(n2)N2CCC(CC2)C#N)C(F)(F)F)(CC1)c1ccc(F)cc1