Reaction Details
TargetSodium-dependent serotonin transporter
LigandBDBM50428768
Substrate/Competitorn/a
Meas. Tech.ChEMBL_948439 (CHEMBL2342729)
IC50 2.4±n/a nM
Citation Gillman, KWParker, MFSilva, MDegnan, APTora, GOLodge, NJLi, YWLelas, STaber, MKrause, RGBertekap, RLNewton, AEPieschl, RLLengyel, KDJohnson, KATaylor, SJBronson, JJMacor, JE Design, optimization, and in vivo evaluation of a series of pyridine derivatives with dual NK1 antagonism and SERT inhibition for the treatment of depression. Bioorg Med Chem Lett23:407-11 (2012) 
 
Sodium-dependent serotonin transporter
Name:Sodium-dependent serotonin transporter
Type:Multi-pass membrane protein
Mol. Mass.:70322.51
Organism:Homo sapiens (Human)
Description:P31645
Residue:630
BDBM50428768
NameBDBM50428768
Synonyms:CHEMBL2333629
TypeSmall organic molecule
Emp. Form.C26H30F4N4O
Mol. Mass.490.5362
SMILESCN1CCC(COCc2cc(cc(n2)N2CCC(CC2)C#N)C(F)(F)F)(CC1)c1ccc(F)cc1