Reaction Details
TargetSodium-dependent serotonin transporter
LigandBDBM50428792
Substrate/Competitorn/a
Meas. Tech.ChEMBL_948439 (CHEMBL2342729)
IC50 15±n/a nM
Citation Gillman, KWParker, MFSilva, MDegnan, APTora, GOLodge, NJLi, YWLelas, STaber, MKrause, RGBertekap, RLNewton, AEPieschl, RLLengyel, KDJohnson, KATaylor, SJBronson, JJMacor, JE Design, optimization, and in vivo evaluation of a series of pyridine derivatives with dual NK1 antagonism and SERT inhibition for the treatment of depression. Bioorg Med Chem Lett23:407-11 (2012) 
 
Sodium-dependent serotonin transporter
Name:Sodium-dependent serotonin transporter
Type:Multi-pass membrane protein
Mol. Mass.:70322.51
Organism:Homo sapiens (Human)
Description:P31645
Residue:630
BDBM50428792
NameBDBM50428792
Synonyms:CHEMBL2333620
TypeSmall organic molecule
Emp. Form.C25H33F4N3O
Mol. Mass.467.5426
SMILESCCC(CC)Nc1cc(cc(COCC2(CCN(C)CC2)c2ccc(F)cc2)n1)C(F)(F)F