Reaction Details
TargetPeroxisome proliferator-activated receptor alpha
LigandBDBM28701
Substrate/Competitorn/a
Meas. Tech.ChEMBL_948912 (CHEMBL2341206)
EC50 46580±n/a nM
Citation Matin, ADoddareddy, MRGavande, NNammi, SGroundwater, PWRoubin, RHHibbs, DE The discovery of novel isoflavone pan peroxisome proliferator-activated receptor agonists. Bioorg Med Chem21:766-78 (2013) 
 
Peroxisome proliferator-activated receptor alpha
Name:Peroxisome proliferator-activated receptor alpha
Type:Enzyme
Mol. Mass.:52222.08
Organism:Homo sapiens (Human)
Description:Q07869
Residue:468
BDBM28701
NameBDBM28701
Synonyms:2-(4-{2-[(4-chlorophenyl)formamido]ethyl}phenoxy)-2-methylpropanoic acid Bezafibrate Cedur | Sklerofibrat
TypeSmall organic molecule
Emp. Form.C19H20ClNO4
Mol. Mass.361.819
SMILESCC(C)(Oc1ccc(CCNC(=O)c2ccc(Cl)cc2)cc1)C(O)=O