Reaction Details
TargetCarbonic anhydrase 14
LigandBDBM50428803
Substrate/Competitorn/a
Meas. Tech.ChEMBL_949340 (CHEMBL2339338)
Ki 8400±n/a nM
Citation Gavernet, LGonzalez Funes, JLPalestro, PHBruno Blanch, LEEstiu, GLMaresca, ABarrios, ISupuran, CT Inhibition pattern of sulfamide-related compounds in binding to carbonic anhydrase isoforms I, II, VII, XII and XIV. Bioorg Med Chem21:1410-8 (2013) 
 
Carbonic anhydrase 14
Name:Carbonic anhydrase 14
Type:Enzyme
Mol. Mass.:37665.67
Organism:Homo sapiens (Human)
Description:Human (cloned) isozyme.
Residue:337
BDBM50428803
NameBDBM50428803
Synonyms:CHEMBL461137
TypeSmall organic molecule
Emp. Form.C8H16N2O6S
Mol. Mass.268.287
SMILESCOC(=O)CCNS(=O)(=O)NCCC(=O)OC