Reaction Details
TargetCarbonic anhydrase 14
LigandBDBM50428805
Substrate/Competitorn/a
Meas. Tech.ChEMBL_949340 (CHEMBL2339338)
Ki>200000±n/a nM
Citation Gavernet, LGonzalez Funes, JLPalestro, PHBruno Blanch, LEEstiu, GLMaresca, ABarrios, ISupuran, CT Inhibition pattern of sulfamide-related compounds in binding to carbonic anhydrase isoforms I, II, VII, XII and XIV. Bioorg Med Chem21:1410-8 (2013) 
 
Carbonic anhydrase 14
Name:Carbonic anhydrase 14
Type:Enzyme
Mol. Mass.:37665.67
Organism:Homo sapiens (Human)
Description:Human (cloned) isozyme.
Residue:337
BDBM50428805
NameBDBM50428805
Synonyms:CHEMBL441884
TypeSmall organic molecule
Emp. Form.C12H28N2O2S
Mol. Mass.264.428
SMILESCCCN(CCC)S(=O)(=O)N(CCC)CCC