Reaction Details
TargetCarbonic anhydrase 12
LigandBDBM50428805
Substrate/Competitorn/a
Meas. Tech.ChEMBL_949341 (CHEMBL2339339)
Ki>200000±n/a nM
Citation Gavernet, LGonzalez Funes, JLPalestro, PHBruno Blanch, LEEstiu, GLMaresca, ABarrios, ISupuran, CT Inhibition pattern of sulfamide-related compounds in binding to carbonic anhydrase isoforms I, II, VII, XII and XIV. Bioorg Med Chem21:1410-8 (2013) 
 
Carbonic anhydrase 12
Name:Carbonic anhydrase 12
Type:Enzyme
Mol. Mass.:39456.00
Organism:Homo sapiens (Human)
Description:Catalytic domain of human cloned isozyme was used in the assay
Residue:354
BDBM50428805
NameBDBM50428805
Synonyms:CHEMBL441884
TypeSmall organic molecule
Emp. Form.C12H28N2O2S
Mol. Mass.264.428
SMILESCCCN(CCC)S(=O)(=O)N(CCC)CCC