Reaction Details
TargetCarbonic anhydrase 12
LigandBDBM50124161
Substrate/Competitorn/a
Meas. Tech.ChEMBL_949341 (CHEMBL2339339)
Ki 940±n/a nM
Citation Gavernet, LGonzalez Funes, JLPalestro, PHBruno Blanch, LEEstiu, GLMaresca, ABarrios, ISupuran, CT Inhibition pattern of sulfamide-related compounds in binding to carbonic anhydrase isoforms I, II, VII, XII and XIV. Bioorg Med Chem21:1410-8 (2013) 
 
Carbonic anhydrase 12
Name:Carbonic anhydrase 12
Type:Enzyme
Mol. Mass.:39456.00
Organism:Homo sapiens (Human)
Description:Catalytic domain of human cloned isozyme was used in the assay
Residue:354
BDBM50124161
NameBDBM50124161
Synonyms:CHEMBL168526 | N-benzylsulfamide
TypeSmall organic molecule
Emp. Form.C7H10N2O2S
Mol. Mass.186.232
SMILESNS(=O)(=O)NCc1ccccc1