Reaction Details
TargetCarbonic anhydrase 7
LigandBDBM50428812
Substrate/Competitorn/a
Meas. Tech.ChEMBL_949342 (CHEMBL2339340)
Ki 380±n/a nM
Citation Gavernet, LGonzalez Funes, JLPalestro, PHBruno Blanch, LEEstiu, GLMaresca, ABarrios, ISupuran, CT Inhibition pattern of sulfamide-related compounds in binding to carbonic anhydrase isoforms I, II, VII, XII and XIV. Bioorg Med Chem21:1410-8 (2013) 
 
Carbonic anhydrase 7
Name:Carbonic anhydrase 7
Type:Enzyme
Mol. Mass.:29664.11
Organism:Homo sapiens (Human)
Description:Human cloned isozyme.
Residue:264
BDBM50428812
NameBDBM50428812
Synonyms:BENZYL(BENZYLSULFAMOYL)AMINE | N,N''-Dibenzylsulfamide
TypeSmall organic molecule
Emp. Form.C14H16N2O2S
Mol. Mass.276.354
SMILESO=S(=O)(NCc1ccccc1)NCc1ccccc1