Reaction Details
TargetCarbonic anhydrase 2
LigandBDBM50428810
Substrate/Competitorn/a
Meas. Tech.ChEMBL_949343 (CHEMBL2339341)
Ki 66300±n/a nM
Citation Gavernet, LGonzalez Funes, JLPalestro, PHBruno Blanch, LEEstiu, GLMaresca, ABarrios, ISupuran, CT Inhibition pattern of sulfamide-related compounds in binding to carbonic anhydrase isoforms I, II, VII, XII and XIV. Bioorg Med Chem21:1410-8 (2013) 
 
Carbonic anhydrase 2
Name:Carbonic anhydrase 2
Type:Enzyme
Mol. Mass.:29250.71
Organism:Homo sapiens (Human)
Description:P00918
Residue:260
BDBM50428810
NameBDBM50428810
Synonyms:BUTYL(BUTYLSULFAMOYL)AMINE
TypeSmall organic molecule
Emp. Form.C8H20N2O2S
Mol. Mass.208.322
SMILESCCCCNS(=O)(=O)NCCCC