Reaction Details
TargetCarbonic anhydrase 1
LigandBDBM50428811
Substrate/Competitorn/a
Meas. Tech.ChEMBL_949344 (CHEMBL2339342)
Ki>200000±n/a nM
Citation Gavernet, LGonzalez Funes, JLPalestro, PHBruno Blanch, LEEstiu, GLMaresca, ABarrios, ISupuran, CT Inhibition pattern of sulfamide-related compounds in binding to carbonic anhydrase isoforms I, II, VII, XII and XIV. Bioorg Med Chem21:1410-8 (2013) 
 
Carbonic anhydrase 1
Name:Carbonic anhydrase 1
Type:Enzyme
Mol. Mass.:28873.37
Organism:Homo sapiens (Human)
Description:P00915
Residue:261
BDBM50428811
NameBDBM50428811
Synonyms:CHEMBL1630902
TypeSmall organic molecule
Emp. Form.C16H20N2O2S
Mol. Mass.304.407
SMILESO=S(=O)(NCCc1ccccc1)NCCc1ccccc1