Reaction Details
TargetCarbonic anhydrase 1
LigandBDBM50428813
Substrate/Competitorn/a
Meas. Tech.ChEMBL_949344 (CHEMBL2339342)
Ki 6880±n/a nM
Citation Gavernet, LGonzalez Funes, JLPalestro, PHBruno Blanch, LEEstiu, GLMaresca, ABarrios, ISupuran, CT Inhibition pattern of sulfamide-related compounds in binding to carbonic anhydrase isoforms I, II, VII, XII and XIV. Bioorg Med Chem21:1410-8 (2013) 
 
Carbonic anhydrase 1
Name:Carbonic anhydrase 1
Type:Enzyme
Mol. Mass.:28873.37
Organism:Homo sapiens (Human)
Description:P00915
Residue:261
BDBM50428813
NameBDBM50428813
Synonyms:CHEMBL375030
TypeSmall organic molecule
Emp. Form.C11H24N2O4S
Mol. Mass.280.384
SMILESCCCN(CCC)S(=O)(=O)NC(=O)OC(C)(C)C