Reaction Details
TargetPeroxisome proliferator-activated receptor gamma
LigandBDBM50428827
Substrate/Competitorn/a
Meas. Tech.ChEMBL_944087 (CHEMBL2341920)
Kd 287±n/a nM
Citation de Groot, JCWeidner, CKrausze, JKawamoto, KSchroeder, FCSauer, SBüssow, K Structural characterization of amorfrutins bound to the peroxisome proliferator-activated receptor¿. J Med Chem56:1535-43 (2013) 
 
Peroxisome proliferator-activated receptor gamma
Name:Peroxisome proliferator-activated receptor gamma
Type:Nuclear Receptor
Mol. Mass.:57613.46
Organism:Homo sapiens (Human)
Description:P37231
Residue:505
BDBM50428827
NameBDBM50428827
Synonyms:CHEMBL2337126
TypeSmall organic molecule
Emp. Form.C18H26O4
Mol. Mass.306.3966
SMILES[#6]-[#6]-[#6]-[#6]-[#6]-c1cc(-[#8]-[#6])c(-[#6]\[#6]=[#6](\[#6])-[#6])c(-[#8])c1-[#6](-[#8])=O