Reaction Details
TargetPeroxisome proliferator-activated receptor delta
LigandBDBM50127222
Substrate/Competitorn/a
Meas. Tech.ChEMBL_944088 (CHEMBL2341921)
Kd 0.400000±n/a nM
Citation de Groot, JCWeidner, CKrausze, JKawamoto, KSchroeder, FCSauer, SBüssow, K Structural characterization of amorfrutins bound to the peroxisome proliferator-activated receptor¿. J Med Chem56:1535-43 (2013) 
 
Peroxisome proliferator-activated receptor delta
Name:Peroxisome proliferator-activated receptor delta
Type:Enzyme
Mol. Mass.:49910.45
Organism:Homo sapiens (Human)
Description:Q03181
Residue:441
BDBM50127222
NameBDBM50127222
Synonyms:CHEMBL38508 {4-[2-(3-Fluoro-4-trifluoromethyl-phenyl)-4-methyl-thiazol-5-ylmethylsulfanyl]-2-methyl-phenoxy}-acetic acid
TypeSmall organic molecule
Emp. Form.C21H17F4NO3S2
Mol. Mass.471.488
SMILESCc1nc(sc1CSc1ccc(OCC(O)=O)c(C)c1)-c1ccc(c(F)c1)C(F)(F)F