Reaction Details
TargetInterstitial collagenase
LigandBDBM50137279
Substrate/Competitorn/a
Meas. Tech.ChEMBL_944092 (CHEMBL2341925)
IC50 0.041000±n/a nM
Citation Jain, PSaravanan, CSingh, SK Sulphonamides: Deserving class as MMP inhibitors? Eur J Med Chem60:89-100 (2013) 
 
Interstitial collagenase
Name:Interstitial collagenase
Type:Enzyme
Mol. Mass.:54010.26
Organism:Homo sapiens (Human)
Description: P03956
Residue:469
BDBM50137279
NameBDBM50137279
Synonyms:6-Hydroxy-2-(4-nitro-benzenesulfonyl)-1,2,3,4-tetrahydro-isoquinoline-1-carboxylic acid hydroxyamide N,6-dihydroxy-2-(4-nitrophenylsulfonyl)-1,2,3,4-tetrahydroisoquinoline-1-carboxamide
TypeSmall organic molecule
Emp. Form.C16H15N3O7S
Mol. Mass.393.371
SMILESONC(=O)C1N(CCc2cc(O)ccc12)S(=O)(=O)c1ccc(cc1)[N+]([O-])=O