Reaction Details
TargetMatrix metalloproteinase-9
LigandBDBM50096476
Substrate/Competitorn/a
Meas. Tech.ChEMBL_944094 (CHEMBL2341927)
IC50 181±n/a nM
Citation Jain, PSaravanan, CSingh, SK Sulphonamides: Deserving class as MMP inhibitors? Eur J Med Chem60:89-100 (2013) 
 
Matrix metalloproteinase-9
Name:Matrix metalloproteinase-9
Type:Enzyme
Mol. Mass.:78452.28
Organism:Homo sapiens (Human)
Description:P14780
Residue:707
BDBM50096476
NameBDBM50096476
Synonyms:(R)-2-[Benzyl-(4-methoxy-benzenesulfonyl)-amino]-cyclohexanecarboxylic acid hydroxyamide | CHEMBL81113
TypeSmall organic molecule
Emp. Form.C21H26N2O5S
Mol. Mass.418.507
SMILESCOc1ccc(cc1)S(=O)(=O)N(Cc1ccccc1)C1CCCC[C@H]1C(=O)NO