Reaction Details
TargetMatrix metalloproteinase-9
LigandBDBM50096477
Substrate/Competitorn/a
Meas. Tech.ChEMBL_944094 (CHEMBL2341927)
IC50 15±n/a nM
Citation Jain, PSaravanan, CSingh, SK Sulphonamides: Deserving class as MMP inhibitors? Eur J Med Chem60:89-100 (2013) 
 
Matrix metalloproteinase-9
Name:Matrix metalloproteinase-9
Type:Enzyme
Mol. Mass.:78452.28
Organism:Homo sapiens (Human)
Description:P14780
Residue:707
BDBM50096477
NameBDBM50096477
Synonyms:3-[Benzyl-(4-methoxy-benzenesulfonyl)-amino]-N-hydroxy-2,6-dimethoxy-isonicotinamide | CHEMBL421699
TypeSmall organic molecule
Emp. Form.C22H23N3O7S
Mol. Mass.473.499
SMILESCOc1ccc(cc1)S(=O)(=O)N(Cc1ccccc1)c1c(OC)nc(OC)cc1C(=O)NO