Reaction Details
TargetMatrix metalloproteinase-9
LigandBDBM50161331
Substrate/Competitorn/a
Meas. Tech.ChEMBL_944094 (CHEMBL2341927)
IC50 200±n/a nM
Citation Jain, PSaravanan, CSingh, SK Sulphonamides: Deserving class as MMP inhibitors? Eur J Med Chem60:89-100 (2013) 
 
Matrix metalloproteinase-9
Name:Matrix metalloproteinase-9
Type:Enzyme
Mol. Mass.:78452.28
Organism:Homo sapiens (Human)
Description:P14780
Residue:707
BDBM50161331
NameBDBM50161331
Synonyms:2-[(Biphenyl-4-sulfonyl)-isopropoxy-amino]-N-hydroxy-acetamide N-hydroxy-2-(N-isopropoxybiphenyl-4-ylsulfonamido)acetamide
TypeSmall organic molecule
Emp. Form.C17H20N2O5S
Mol. Mass.364.416
SMILESCC(C)ON(CC(=O)NO)S(=O)(=O)c1ccc(cc1)-c1ccccc1