Reaction Details
TargetStromelysin-1
LigandBDBM13080
Substrate/Competitorn/a
Meas. Tech.ChEMBL_944582 (CHEMBL2339487)
IC50 6500±n/a nM
Citation Jain, PSaravanan, CSingh, SK Sulphonamides: Deserving class as MMP inhibitors? Eur J Med Chem60:89-100 (2013) 
 
Stromelysin-1
Name:Stromelysin-1
Type:Enzyme
Mol. Mass.:53973.13
Organism:Homo sapiens (Human)
Description: P08254
Residue:477
BDBM13080
NameBDBM13080
Synonyms:CGS 27023A Analog 3 US20230357139, Compound A | US20240050571, Compound NNGH
TypeSmall organic molecule
Emp. Form.C13H20N2O5S
Mol. Mass.316.373
SMILESCOc1ccc(cc1)S(=O)(=O)N(CC(C)C)CC(=O)NO