Reaction Details
TargetCarbonic anhydrase 9
LigandBDBM50428839
Substrate/Competitorn/a
Meas. Tech.ChEMBL_944594 (CHEMBL2339499)
Ki 5.4±n/a nM
Citation Alafeefy, AMIsik, SAbdel-Aziz, HAAshour, AEVullo, DAl-Jaber, NASupuran, CT Carbonic anhydrase inhibitors: benzenesulfonamides incorporating cyanoacrylamide moieties are low nanomolar/subnanomolar inhibitors of the tumor-associated isoforms IX and XII. Bioorg Med Chem21:1396-403 (2013) 
 
Carbonic anhydrase 9
Name:Carbonic anhydrase 9
Type:Enzyme
Mol. Mass.:49669.03
Organism:Homo sapiens (Human)
Description:Catalytic domain of human cloned isozyme was used in the assay
Residue:459
BDBM50428839
NameBDBM50428839
Synonyms:CHEMBL2337529
TypeSmall organic molecule
Emp. Form.C17H15N3O5S
Mol. Mass.373.383
SMILESCOc1cc(\C=C(/C#N)C(=O)Nc2ccc(cc2)S(N)(=O)=O)ccc1O