Reaction Details
TargetCarbonic anhydrase 2
LigandBDBM50428831
Substrate/Competitorn/a
Meas. Tech.ChEMBL_944595 (CHEMBL2339500)
Ki 11±n/a nM
Citation Alafeefy, AMIsik, SAbdel-Aziz, HAAshour, AEVullo, DAl-Jaber, NASupuran, CT Carbonic anhydrase inhibitors: benzenesulfonamides incorporating cyanoacrylamide moieties are low nanomolar/subnanomolar inhibitors of the tumor-associated isoforms IX and XII. Bioorg Med Chem21:1396-403 (2013) 
 
Carbonic anhydrase 2
Name:Carbonic anhydrase 2
Type:Enzyme
Mol. Mass.:29250.71
Organism:Homo sapiens (Human)
Description:P00918
Residue:260
BDBM50428831
NameBDBM50428831
Synonyms:CHEMBL2337536
TypeSmall organic molecule
Emp. Form.C16H13N3O4S
Mol. Mass.343.357
SMILESNS(=O)(=O)c1ccc(NC(=O)c2cc3ccccc3oc2=N)cc1