Reaction Details
TargetCarbonic anhydrase 2
LigandBDBM50428840
Substrate/Competitorn/a
Meas. Tech.ChEMBL_944595 (CHEMBL2339500)
Ki 19±n/a nM
Citation Alafeefy, AMIsik, SAbdel-Aziz, HAAshour, AEVullo, DAl-Jaber, NASupuran, CT Carbonic anhydrase inhibitors: benzenesulfonamides incorporating cyanoacrylamide moieties are low nanomolar/subnanomolar inhibitors of the tumor-associated isoforms IX and XII. Bioorg Med Chem21:1396-403 (2013) 
 
Carbonic anhydrase 2
Name:Carbonic anhydrase 2
Type:Enzyme
Mol. Mass.:29250.71
Organism:Homo sapiens (Human)
Description:P00918
Residue:260
BDBM50428840
NameBDBM50428840
Synonyms:CHEMBL2337528
TypeSmall organic molecule
Emp. Form.C18H17N3O5S
Mol. Mass.387.41
SMILESCOc1ccc(\C=C(/C#N)C(=O)Nc2ccc(cc2)S(N)(=O)=O)cc1OC