Reaction Details
TargetCarbonic anhydrase 1
LigandBDBM50428840
Substrate/Competitorn/a
Meas. Tech.ChEMBL_944596 (CHEMBL2339501)
Ki 31±n/a nM
Citation Alafeefy, AMIsik, SAbdel-Aziz, HAAshour, AEVullo, DAl-Jaber, NASupuran, CT Carbonic anhydrase inhibitors: benzenesulfonamides incorporating cyanoacrylamide moieties are low nanomolar/subnanomolar inhibitors of the tumor-associated isoforms IX and XII. Bioorg Med Chem21:1396-403 (2013) 
 
Carbonic anhydrase 1
Name:Carbonic anhydrase 1
Type:Enzyme
Mol. Mass.:28873.37
Organism:Homo sapiens (Human)
Description:P00915
Residue:261
BDBM50428840
NameBDBM50428840
Synonyms:CHEMBL2337528
TypeSmall organic molecule
Emp. Form.C18H17N3O5S
Mol. Mass.387.41
SMILESCOc1ccc(\C=C(/C#N)C(=O)Nc2ccc(cc2)S(N)(=O)=O)cc1OC