Reaction Details
TargetCarbonic anhydrase 1
LigandBDBM50428848
Substrate/Competitorn/a
Meas. Tech.ChEMBL_944596 (CHEMBL2339501)
Ki 41±n/a nM
Citation Alafeefy, AMIsik, SAbdel-Aziz, HAAshour, AEVullo, DAl-Jaber, NASupuran, CT Carbonic anhydrase inhibitors: benzenesulfonamides incorporating cyanoacrylamide moieties are low nanomolar/subnanomolar inhibitors of the tumor-associated isoforms IX and XII. Bioorg Med Chem21:1396-403 (2013) 
 
Carbonic anhydrase 1
Name:Carbonic anhydrase 1
Type:Enzyme
Mol. Mass.:28873.37
Organism:Homo sapiens (Human)
Description:P00915
Residue:261
BDBM50428848
NameBDBM50428848
Synonyms:CHEMBL2337541
TypeSmall organic molecule
Emp. Form.C16H12ClN3O3S
Mol. Mass.361.803
SMILESNS(=O)(=O)c1ccc(NC(=O)C(=C\c2ccccc2Cl)\C#N)cc1