Reaction Details
Target5-hydroxytryptamine receptor 2C
LigandBDBM50004327
Substrate/Competitorn/a
Meas. Tech.ChEMBL_946125 (CHEMBL2343053)
Ki 10000±n/a nM
Citation Jensen, AAPlath, NPedersen, MHIsberg, VKrall, JWellendorph, PStensbøl, TBGloriam, DEKrogsgaard-Larsen, PFrølund, B Design, synthesis, and pharmacological characterization of N- and O-substituted 5,6,7,8-tetrahydro-4H-isoxazolo[4,5-d]azepin-3-ol analogues: novel 5-HT(2A)/5-HT(2C) receptor agonists with pro-cognitive properties. J Med Chem56:1211-27 (2013) 
 
5-hydroxytryptamine receptor 2C
Name:5-hydroxytryptamine receptor 2C
Type:G Protein-Coupled Receptor (GPCR)
Mol. Mass.:51836.79
Organism:Homo sapiens (Human)
Description:P28335
Residue:458
BDBM50004327
NameBDBM50004327
Synonyms:(1-Phenethyl-piperidin-4-yl)-phenyl-methanol Glemanserin MDL-11939
TypeSmall organic molecule
Emp. Form.C20H25NO
Mol. Mass.295.4186
SMILESOC(C1CCN(CCc2ccccc2)CC1)c1ccccc1