Reaction Details
Target5-hydroxytryptamine receptor 2C
LigandBDBM31005
Substrate/Competitorn/a
Meas. Tech.ChEMBL_946114 (CHEMBL2343042)
Ki 1.7±n/a nM
Citation Jensen, AAPlath, NPedersen, MHIsberg, VKrall, JWellendorph, PStensbøl, TBGloriam, DEKrogsgaard-Larsen, PFrølund, B Design, synthesis, and pharmacological characterization of N- and O-substituted 5,6,7,8-tetrahydro-4H-isoxazolo[4,5-d]azepin-3-ol analogues: novel 5-HT(2A)/5-HT(2C) receptor agonists with pro-cognitive properties. J Med Chem56:1211-27 (2013) 
 
5-hydroxytryptamine receptor 2C
Name:5-hydroxytryptamine receptor 2C
Type:G Protein-Coupled Receptor (GPCR)
Mol. Mass.:51836.79
Organism:Homo sapiens (Human)
Description:P28335
Residue:458
BDBM31005
NameBDBM31005
Synonyms:2-methyl-1,2,3,4,10,14b-hexahydrodibenzo[c,f]pyrazino[1,2-a]azepine MLS000069681 cid_68551
TypeSmall organic molecule
Emp. Form.C18H21ClN2
Mol. Mass.300.826
SMILESCl.CN1CCN2C(C1)c1ccccc1Cc1ccccc21