Reaction Details
TargetTranslocator protein
LigandBDBM50429209
Substrate/Competitorn/a
Meas. Tech.ChEMBL_945637 (CHEMBL2344971)
Ki 33±n/a nM
Citation Fukaya, TKodo, TIshiyama, TNishikawa, HBaba, SMasumoto, S Design, synthesis and structure-activity relationship of novel tricyclic benzimidazolone derivatives as potent 18 kDa translocator protein (TSPO) ligands. Bioorg Med Chem21:1257-67 (2013) 
 
Translocator protein
Name:Translocator protein
Type:Mitochondrion membrane protein
Mol. Mass.:18945.84
Organism:Rattus norvegicus (rat)
Description:Competitive binding experiments were performed on rat kidney mitochondrial membranes.
Residue:169
BDBM50429209
NameBDBM50429209
Synonyms:CHEMBL2331873
TypeSmall organic molecule
Emp. Form.C24H21N3O2
Mol. Mass.383.4424
SMILESO=C(Cn1c2cc(cc3CCCn(c23)c1=O)-c1ccccc1)Nc1ccccc1