Reaction Details
TargetCarbonic anhydrase 9
LigandBDBM50429227
Substrate/Competitorn/a
Meas. Tech.ChEMBL_946164 (CHEMBL2344043)
Ki 67±n/a nM
Citation Güzel-Akdemir, ÖAkdemir, AIsik, SVullo, DSupuran, CT o-Benzenedisulfonimido-sulfonamides are potent inhibitors of the tumor-associated carbonic anhydrase isoforms CA IX and CA XII. Bioorg Med Chem21:1386-91 (2013) 
 
Carbonic anhydrase 9
Name:Carbonic anhydrase 9
Type:Enzyme
Mol. Mass.:49669.03
Organism:Homo sapiens (Human)
Description:Catalytic domain of human cloned isozyme was used in the assay
Residue:459
BDBM50429227
NameBDBM50429227
Synonyms:CHEMBL2332772
TypeSmall organic molecule
Emp. Form.C12H10N2O6S3
Mol. Mass.374.413
SMILESNS(=O)(=O)c1ccccc1N1S(=O)(=O)c2ccccc2S1(=O)=O