Reaction Details
Target5-hydroxytryptamine receptor 2A
LigandBDBM50001884
Substrate/Competitorn/a
Meas. Tech.ChEMBL_947081 (CHEMBL2340586)
Ki 20±n/a nM
Citation Gomes, TFPompeu, TERodrigues, DANoël, FMenegatti, RAndrade, CHSabino, JRGil, ESDalla Costa, TBetti, AHAntonio, CBRates, SMFraga, CABarreiro, EJde Oliveira, V Biotransformation of LASSBio-579 and pharmacological evaluation of p-hydroxylated metabolite a N-phenylpiperazine antipsychotic lead compound. Eur J Med Chem62:214-21 (2013) 
 
5-hydroxytryptamine receptor 2A
Name:5-hydroxytryptamine receptor 2A
Type:G Protein-Coupled Receptor (GPCR)
Mol. Mass.:52852.05
Organism:Rattus norvegicus (rat)
Description:Rat cortex membranes 5-HT2A receptors.
Residue:471
BDBM50001884
NameBDBM50001884
Synonyms:2-[4-(4-Methyl-benzyl)-piperazin-1-yl]-1-(2-methyl-2,3-dihydro-indol-1-yl)-ethanone 3-chloro-6-(4-methyl-piperazin-1-yl)-5H-dibenzo[b,e][1,4]diazepine 8-Chloro-11-(4-methyl-piperazin-1-yl)-5H-dibenzo[b,e][1,4]diazepine( Clozepine ) 8-Chloro-11-(4-methyl-piperazin-1-yl)-5H-dibenzo[b,e][1,4]diazepine(Clopazine) 8-chloro-11-(4-methylpiperazin-1-yl)-5H-dibenzo[b,e][1,4]diazepine CHEMBL538973 CLOZAPINE, 8-CHLORO-11-(4-METHYL-PIPERAZIN-1-YL)-5H-DIBENZO[B,E][1,4]DIAZEPINE HF 1854 US10752588, Compound Clozapine | US11498896, Compound Clozapine
TypeSmall organic molecule
Emp. Form.C18H19ClN4
Mol. Mass.326.823
SMILESCN1CCN(CC1)C1=Nc2cc(Cl)ccc2Nc2ccccc12