Reaction Details
TargetCytochrome P450 11B1, mitochondrial
LigandBDBM8611
Substrate/Competitorn/a
Meas. Tech.ChEMBL_944709 (CHEMBL2340955)
IC50 6.3±n/a nM
Citation Gobbi, SHu, QNegri, MZimmer, CBelluti, FRampa, AHartmann, RWBisi, A Modulation of cytochromes P450 with xanthone-based molecules: from aromatase to aldosterone synthase and steroid 11ß-hydroxylase inhibition. J Med Chem56:1723-9 (2013) 
 
Cytochrome P450 11B1, mitochondrial
Name:Cytochrome P450 11B1, mitochondrial
Type:Enzyme
Mol. Mass.:57591.44
Organism:Homo sapiens (Human)
Description:P15538
Residue:503
BDBM8611
NameBDBM8611
Synonyms:4-{5H,6H,7H,8H-imidazo[1,5-a]pyridin-5-yl}benzonitrile CHEMBL9298 US9271963, Fadrozole
TypeSmall organic molecule
Emp. Form.C14H13N3
Mol. Mass.223.2731
SMILESN#Cc1ccc(cc1)C1CCCc2cncn12