Reaction Details
TargetHistone deacetylase 4
LigandBDBM50015184
Substrate/Competitorn/a
Meas. Tech.ChEMBL_944721 (CHEMBL2340967)
Temperature298.15±n/a K
IC50>33330±n/a nM
Commentsextracted
Citation Wagner, FFOlson, DEGale, JPKaya, TWeïwer, MAidoud, NThomas, MDavoine, ELLemercier, BCZhang, YLHolson, EB Potent and selective inhibition of histone deacetylase 6 (HDAC6) does not require a surface-binding motif. J Med Chem56:1772-6 (2013) 
 
Histone deacetylase 4
Name:Histone deacetylase 4
Type:Enzyme
Mol. Mass.:119049.39
Organism:Homo sapiens (Human)
Description:P56524
Residue:1084
BDBM50015184
NameBDBM50015184
Synonyms:BENZHYDROXAMIC ACID CHEMBL16300 N-hydroxybenzamide | benzoyl hydroxamic acid
TypeSmall organic molecule
Emp. Form.C7H7NO2
Mol. Mass.137.136
SMILESONC(=O)c1ccccc1