Reaction Details
TargetHistone deacetylase 4
LigandBDBM50429528
Substrate/Competitorn/a
Meas. Tech.ChEMBL_944721 (CHEMBL2340967)
Temperature298.15±n/a K
IC50>33330±n/a nM
Commentsextracted
Citation Wagner, FFOlson, DEGale, JPKaya, TWeïwer, MAidoud, NThomas, MDavoine, ELLemercier, BCZhang, YLHolson, EB Potent and selective inhibition of histone deacetylase 6 (HDAC6) does not require a surface-binding motif. J Med Chem56:1772-6 (2013) 
 
Histone deacetylase 4
Name:Histone deacetylase 4
Type:Enzyme
Mol. Mass.:119049.39
Organism:Homo sapiens (Human)
Description:P56524
Residue:1084
BDBM50429528
NameBDBM50429528
Synonyms:CHEMBL2333343
TypeSmall organic molecule
Emp. Form.C9H10N2O3
Mol. Mass.194.1873
SMILESCNC(=O)c1ccc(cc1)C(=O)NO