Reaction Details
TargetHistone deacetylase 2
LigandBDBM50429525
Substrate/Competitorn/a
Meas. Tech.ChEMBL_944722 (CHEMBL2340968)
Temperature298.15±n/a K
IC50 1790±n/a nM
Commentsextracted
Citation Wagner, FFOlson, DEGale, JPKaya, TWeïwer, MAidoud, NThomas, MDavoine, ELLemercier, BCZhang, YLHolson, EB Potent and selective inhibition of histone deacetylase 6 (HDAC6) does not require a surface-binding motif. J Med Chem56:1772-6 (2013) 
 
Histone deacetylase 2
Name:Histone deacetylase 2
Type:Chromatin regulator; hydrolase; repressor
Mol. Mass.:55356.54
Organism:Homo sapiens (Human)
Description:Q92769
Residue:488
BDBM50429525
NameBDBM50429525
Synonyms:CHEMBL2333346
TypeSmall organic molecule
Emp. Form.C6H9NO2
Mol. Mass.127.1412
SMILESONC(=O)C1=CCCC1