Reaction Details
TargetHistone deacetylase 8
LigandBDBM50429530
Substrate/Competitorn/a
Meas. Tech.ChEMBL_944719 (CHEMBL2340965)
Temperature298.15±n/a K
IC50 1030±n/a nM
Commentsextracted
Citation Wagner, FFOlson, DEGale, JPKaya, TWeïwer, MAidoud, NThomas, MDavoine, ELLemercier, BCZhang, YLHolson, EB Potent and selective inhibition of histone deacetylase 6 (HDAC6) does not require a surface-binding motif. J Med Chem56:1772-6 (2013) 
 
Histone deacetylase 8
Name:Histone deacetylase 8
Type:Enzyme
Mol. Mass.:41749.60
Organism:Homo sapiens (Human)
Description:Q9BY41
Residue:377
BDBM50429530
NameBDBM50429530
Synonyms:CHEMBL2333341
TypeSmall organic molecule
Emp. Form.C15H14N2O3
Mol. Mass.270.2833
SMILESONC(=O)c1ccc(cc1)C(=O)NCc1ccccc1