Reaction Details
TargetHistone deacetylase 7
LigandBDBM50380399
Substrate/Competitorn/a
Meas. Tech.ChEMBL_944711 (CHEMBL2340957)
Temperature298.15±n/a K
IC50 379±n/a nM
Commentsextracted
Citation Wagner, FFOlson, DEGale, JPKaya, TWeïwer, MAidoud, NThomas, MDavoine, ELLemercier, BCZhang, YLHolson, EB Potent and selective inhibition of histone deacetylase 6 (HDAC6) does not require a surface-binding motif. J Med Chem56:1772-6 (2013) 
 
Histone deacetylase 7
Name:Histone deacetylase 7
Type:Chromatin regulator; hydrolase; repressor
Mol. Mass.:102942.62
Organism:Homo sapiens (Human)
Description:Q8WUI4
Residue:952
BDBM50380399
NameBDBM50380399
Synonyms:CHEMBL2018302 US10227295, Compound Tubastatin A US11207431, Example D US9249087, Tubacin US9956192, Compound Tubastatin-A
TypeSmall organic molecule
Emp. Form.C20H21N3O2
Mol. Mass.335.3996
SMILESCN1CCc2c(C1)c1ccccc1n2Cc1ccc(cc1)C(=O)NO