Reaction Details
TargetHistone deacetylase 6
LigandBDBM50015088
Substrate/Competitorn/a
Meas. Tech.ChEMBL_944720 (CHEMBL2340966)
Temperature298.15±n/a K
IC50 22±n/a nM
Commentsextracted
Citation Wagner, FFOlson, DEGale, JPKaya, TWeïwer, MAidoud, NThomas, MDavoine, ELLemercier, BCZhang, YLHolson, EB Potent and selective inhibition of histone deacetylase 6 (HDAC6) does not require a surface-binding motif. J Med Chem56:1772-6 (2013) 
 
Histone deacetylase 6
Name:Histone deacetylase 6
Type:Chromatin regulator; hydrolase; repressor
Mol. Mass.:131381.51
Organism:Homo sapiens (Human)
Description:Q9UBN7
Residue:1215
BDBM50015088
NameBDBM50015088
Synonyms:(E)-N-Hydroxy-3-phenyl-acrylamide CHEMBL154574 US10188756, Compound CN86 | trans-N-Hydroxy-3-phenyl-acrylamide
TypeSmall organic molecule
Emp. Form.C9H9NO2
Mol. Mass.163.1733
SMILESONC(=O)\C=C\c1ccccc1