Reaction Details
TargetHistone deacetylase 6
LigandBDBM50429532
Substrate/Competitorn/a
Meas. Tech.ChEMBL_944720 (CHEMBL2340966)
Temperature298.15±n/a K
IC50 8.0±n/a nM
Commentsextracted
Citation Wagner, FFOlson, DEGale, JPKaya, TWeïwer, MAidoud, NThomas, MDavoine, ELLemercier, BCZhang, YLHolson, EB Potent and selective inhibition of histone deacetylase 6 (HDAC6) does not require a surface-binding motif. J Med Chem56:1772-6 (2013) 
 
Histone deacetylase 6
Name:Histone deacetylase 6
Type:Chromatin regulator; hydrolase; repressor
Mol. Mass.:131381.51
Organism:Homo sapiens (Human)
Description:Q9UBN7
Residue:1215
BDBM50429532
NameBDBM50429532
Synonyms:CHEMBL2333339
TypeSmall organic molecule
Emp. Form.C15H15N3O3
Mol. Mass.285.2979
SMILESONC(=O)c1ccc(cc1)C(=O)NCCc1ccncc1