Reaction Details
TargetProtein S100-B
LigandBDBM50429681
Substrate/Competitorn/a
Meas. Tech.ChEMBL_947124 (CHEMBL2341094)
IC50 8400±n/a nM
Citation Yoshimura, CMiyafusa, TTsumoto, K Identification of small-molecule inhibitors of the human S100B-p53 interaction and evaluation of their activity in human melanoma cells. Bioorg Med Chem21:1109-15 (2013) 
 
Protein S100-B
Name:Protein S100-B
Type:PROTEIN
Mol. Mass.:10701.34
Organism:Homo sapiens (Human)
Description:ChEMBL_947124
Residue:92
BDBM50429681
NameBDBM50429681
Synonyms:CHEMBL2094307 | DNDI1416906
TypeSmall organic molecule
Emp. Form.C11H18N2
Mol. Mass.178.274
SMILESCCN(CC)c1ccc(N)c(C)c1