Reaction Details
TargetProtein S100-B
LigandBDBM50429683
Substrate/Competitorn/a
Meas. Tech.ChEMBL_947124 (CHEMBL2341094)
IC50 42100±n/a nM
Citation Yoshimura, CMiyafusa, TTsumoto, K Identification of small-molecule inhibitors of the human S100B-p53 interaction and evaluation of their activity in human melanoma cells. Bioorg Med Chem21:1109-15 (2013) 
 
Protein S100-B
Name:Protein S100-B
Type:PROTEIN
Mol. Mass.:10701.34
Organism:Homo sapiens (Human)
Description:ChEMBL_947124
Residue:92
BDBM50429683
NameBDBM50429683
Synonyms:4-((4-(Phenylamino)Phenylimino)Methyl)Phenol | CHEMBL2335387
TypeSmall organic molecule
Emp. Form.C19H16N2O
Mol. Mass.288.3431
SMILESOc1ccc(\C=N\c2ccc(Nc3ccccc3)cc2)cc1