Reaction Details
TargetPotassium voltage-gated channel subfamily H member 2
LigandBDBM50348452
Substrate/Competitorn/a
Meas. Tech.ChEMBL_948139 (CHEMBL2338825)
IC50 30400±n/a nM
Citation Pike, KGMalagu, KHummersone, MGMenear, KADuggan, HMGomez, SMartin, NMRuston, LPass, SLPass, M Optimization of potent and selective dual mTORC1 and mTORC2 inhibitors: the discovery of AZD8055 and AZD2014. Bioorg Med Chem Lett23:1212-6 (2013) 
 
Potassium voltage-gated channel subfamily H member 2
Name:Potassium voltage-gated channel subfamily H member 2
Type:Multi-pass membrane protein
Mol. Mass.:126672.65
Organism:Homo sapiens (Human)
Description:Q12809
Residue:1159
BDBM50348452
NameBDBM50348452
Synonyms:AZD-8055 US9102670, 1a
TypeSmall organic molecule
Emp. Form.C25H31N5O4
Mol. Mass.465.5447
SMILESCOc1ccc(cc1CO)-c1ccc2c(nc(nc2n1)N1CCOC[C@@H]1C)N1CCOC[C@@H]1C