Reaction Details
TargetProthrombin
LigandBDBM50429813
Substrate/Competitorn/a
Meas. Tech.ChEMBL_948638 (CHEMBL2345154)
Ki 436±n/a nM
Citation Ilic, MDunkel, PIlaš, JChabielska, EZakrzeska, AMátyus, PKikelj, D Towards dual antithrombotic compounds - balancing thrombin inhibitory and fibrinogen GPIIb/IIIa binding inhibitory activities of 2,3-dihydro-1,4-benzodioxine derivatives through regio- and stereoisomerism. Eur J Med Chem62:329-40 (2013) 
 
Prothrombin
Name:Prothrombin
Type:Protein
Mol. Mass.:70029.57
Organism:Homo sapiens (Human)
Description:P00734
Residue:622
BDBM50429813
NameBDBM50429813
Synonyms:CHEMBL2337676
TypeSmall organic molecule
Emp. Form.C27H28N3O6
Mol. Mass.490.5272
SMILESCCOC(=O)C(=O)N(Cc1ccccc1)c1ccc2O[C@@H](COc3ccc(cc3)C(N)=[NH2+])COc2c1