Reaction Details
TargetCarbonic anhydrase 13
LigandBDBM50429922
Substrate/Competitorn/a
Meas. Tech.ChEMBL_945277 (CHEMBL2340475)
pH7±n/a
Kd 1.7±n/a nM
Commentsextracted
Citation Dudutiene, VZubriene, ASmirnov, AGylyte, JTimm, DManakova, EGražulis, SMatulis, D 4-Substituted-2,3,5,6-tetrafluorobenzenesulfonamides as inhibitors of carbonic anhydrases I, II, VII, XII, and XIII. Bioorg Med Chem21:2093-106 (2013) 
 
Carbonic anhydrase 13
Name:Carbonic anhydrase 13
Type:Enzyme
Mol. Mass.:29445.78
Organism:Homo sapiens (Human)
Description:Q8N1Q1
Residue:262
BDBM50429922
NameBDBM50429922
Synonyms:CHEMBL2333418 | carbonic anhydrase (CA) inhibitors, benzenesulphonamide ligand, 11
TypeSmall organic molecule
Emp. Form.C9H9F4NO2S2
Mol. Mass.303.297
SMILESCCCSc1c(F)c(F)c(c(F)c1F)S(N)(=O)=O