Reaction Details
TargetCarbonic anhydrase 12
LigandBDBM50429901
Substrate/Competitorn/a
Meas. Tech.ChEMBL_945278 (CHEMBL2340476)
pH7±n/a
Kd 333±n/a nM
Commentsextracted
Citation Dudutiene, VZubriene, ASmirnov, AGylyte, JTimm, DManakova, EGražulis, SMatulis, D 4-Substituted-2,3,5,6-tetrafluorobenzenesulfonamides as inhibitors of carbonic anhydrases I, II, VII, XII, and XIII. Bioorg Med Chem21:2093-106 (2013) 
 
Carbonic anhydrase 12
Name:Carbonic anhydrase 12
Type:Enzyme
Mol. Mass.:39456.00
Organism:Homo sapiens (Human)
Description:Catalytic domain of human cloned isozyme was used in the assay
Residue:354
BDBM50429901
NameBDBM50429901
Synonyms:2,3,5,6-Tetrafluorobenzenesulfonamide | CHEMBL2333412
TypeSmall organic molecule
Emp. Form.C6H3F4NO2S
Mol. Mass.229.152
SMILESNS(=O)(=O)c1c(F)c(F)cc(F)c1F